BDBM50458025 CHEMBL4216664
SMILES CCN1CCc2nc(Nc3cc(c(F)cn3)-c3cc(F)c4nc(C)n(C(C)C)c4c3)ccc2C1
InChI Key InChIKey=JYIASQGROAISCJ-UHFFFAOYSA-N
Data  2 IC50
  Tab Delimited (TSV)   2D SDfile   Computed 3D by Vconf -m prep SDfile
Find this compound or compounds like it in BindingDB:
Activity Spreadsheet -- Enzyme Inhibition Constant Data from BindingDB
Found 2 hits for monomerid = 50458025
TargetCyclin-dependent kinase/G2/mitotic-specific cyclin- 1(Homo sapiens (Human))
Shanghai Haihe Pharmaceutical
Curated by ChEMBL
LigandPNGBDBM50458025(CHEMBL4216664)
Affinity DataIC50:  12nM. Assay description: Inhibition of human CDK1/Cyclin-B using ULight-substrate after 1 hr by LANCE assay
Ligand InfoPC cidPC sid
In DepthDetails ArticlePubMed
TargetCyclin-dependent kinase 4/G1/S-specific cyclin-E1(Homo sapiens (Human))
Shanghai Haihe Pharmaceutical
Curated by ChEMBL
LigandPNGBDBM50458025(CHEMBL4216664)
Affinity DataIC50:  2.80nM. Assay description: Inhibition of human CDK4/cyclin D1 using ULight-substrate after 1 hr by LANCE assay
Ligand InfoPC cidPC sid
In DepthDetails ArticlePubMed