BDBM50458728 CHEMBL4214786
SMILES [H][C@@]1(O[C@H]2[C@H](N)C[C@H](N)[C@@H](O[C@@]3([H])O[C@H](CN)[C@@H](O)[C@H](O)[C@H]3O)[C@@H]2O)O[C@H](COCCCCCCCCC)[C@@H](OCCCCCCCCC)[C@H](N)[C@H]1O
InChI Key InChIKey=SVRLLXRKEPURDL-DSNJFVELSA-N
Data  1 IC50
  Tab Delimited (TSV)   2D SDfile   Computed 3D by Vconf -m prep SDfile
Find this compound or compounds like it in BindingDB:
Activity Spreadsheet -- Enzyme Inhibition Constant Data from BindingDB
Found 1 hit for monomerid = 50458728
TargetGap junction beta-2 protein(Homo sapiens)
Utah State University
Curated by ChEMBL
LigandPNGBDBM50458728(CHEMBL4214786)
Affinity DataIC50:  1.88E+4nM. Assay description: Inhibition of recombinant human Cx26 expressed in Escherichia coli LB2003 assessed as reduction in cell growth measured after 18 hrs
Ligand InfoKEGGPC cidPC sid
In DepthDetails ArticlePubMed