BDBM50458931 CHEMBL4205965
SMILES Cc1cccc(COc2cccc3onc(Nc4cccnc4)c23)c1
InChI Key InChIKey=LUZYYLKZWBFFLT-UHFFFAOYSA-N
Data  1 IC50
  Tab Delimited (TSV)   2D SDfile   Computed 3D by Vconf -m prep SDfile
Find this compound or compounds like it in BindingDB:
Activity Spreadsheet -- Enzyme Inhibition Constant Data from BindingDB
Found 1 hit for monomerid = 50458931
TargetPhosphatidylcholine:ceramide cholinephosphotransferase 2(Homo sapiens (Human))
Fudan University
Curated by ChEMBL
LigandPNGBDBM50458931(CHEMBL4205965)
Affinity DataIC50:  190nM. Assay description: Inhibition of human SMS2 using C6-NBD-ceramide and DMPC as substrate preincubated for 5 mins followed by substrate addition and measured after 30 min...
Ligand InfoPC cidPC sid
In DepthDetails ArticlePubMed