BDBM50459058 CHEMBL4207061
SMILES COc1cc(OC)cc(c1)-c1nc(C(=O)NC(N)=N)c(N)nc1N1CCCCCC1
InChI Key InChIKey=LUHQRHGHXGUSNK-UHFFFAOYSA-N
Data  1 KI
  Tab Delimited (TSV)   2D SDfile   Computed 3D by Vconf -m prep SDfile
Find this compound or compounds like it in BindingDB:
Activity Spreadsheet -- Enzyme Inhibition Constant Data from BindingDB
Found 1 hit for monomerid = 50459058
TargetUrokinase-type plasminogen activator(Homo sapiens (Human))
University Of Wollongong
Curated by ChEMBL
LigandPNGBDBM50459058(CHEMBL4207061)
Affinity DataKi:  1.32E+3nM. Assay description: Inhibition of human kidney uPA using Z-Gly-Gly-Arg-AMC as substrate measured over 15 mins by fluorescence assay
Ligand InfoPC cidPC sid
In DepthDetails ArticlePubMed