BDBM50459065 CHEMBL4215760
SMILES NC(=N)NC(=O)c1nc(-c2cc3ccccc3[nH]2)c(nc1N)N1CCCCCC1
InChI Key InChIKey=YYMJBYORFXNXJN-UHFFFAOYSA-N
Data  1 KI
  Tab Delimited (TSV)   2D SDfile   Computed 3D by Vconf -m prep SDfile
Find this compound or compounds like it in BindingDB:
Activity Spreadsheet -- Enzyme Inhibition Constant Data from BindingDB
Found 1 hit for monomerid = 50459065
TargetUrokinase-type plasminogen activator(Homo sapiens (Human))
University Of Wollongong
Curated by ChEMBL
LigandPNGBDBM50459065(CHEMBL4215760)
Affinity DataKi:  5.67E+3nM. Assay description: Inhibition of human kidney uPA using Z-Gly-Gly-Arg-AMC as substrate measured over 15 mins by fluorescence assay
Ligand InfoPC cidPC sid
In DepthDetails ArticlePubMed