BDBM50459882 CHEMBL4060185
SMILES COc1ccc(cc1)-n1nc2c(c[nH]c3ccc(Cl)cc23)c1=O
InChI Key InChIKey=YMMRGIIZANFGIG-UHFFFAOYSA-N
Data  6 KI
  Tab Delimited (TSV)   2D SDfile   Computed 3D by Vconf -m prep SDfile
Find this compound or compounds like it in BindingDB:
Activity Spreadsheet -- Enzyme Inhibition Constant Data from BindingDB
Found 6 hits for monomerid = 50459882
LigandPNGBDBM50459882(CHEMBL4060185)
Affinity DataKi:  0.200nM. Assay description: Displacement of [3H]Ro15-1788 from human GABAA receptor alpha3beta3gamma2 expressed in LTK cells preincubated for 30 secs measured every 15 mins at -...
Ligand InfoPC cidPC sid
In DepthDetails ArticlePubMed
LigandPNGBDBM50459882(CHEMBL4060185)
Affinity DataKi:  0.200nM. Assay description: Displacement of [3H]Ro15-1788 from human GABAA receptor alpha1beta3gamma2 expressed in LTK cells preincubated for 30 secs measured every 15 mins at -...
Target InfoGoogleScholar
Ligand InfoPC cidPC sid
In DepthDetails ArticlePubMed
TargetGABA-A receptor; alpha-5/beta-3/gamma-2(Homo sapiens (Human))
Amgen
Curated by ChEMBL
LigandPNGBDBM50459882(CHEMBL4060185)
Affinity DataKi:  0.300nM. Assay description: Displacement of [3H]Ro15-1788 from human GABAA receptor alpha5beta3gamma2 expressed in LTK cells preincubated for 30 secs measured every 15 mins at -...
Ligand InfoPC cidPC sid
In DepthDetails ArticlePubMed
LigandPNGBDBM50459882(CHEMBL4060185)
Affinity DataKi:  1.90nM. Assay description: Displacement of [3H]Ro15-1788 from human GABAA receptor alpha6beta3gamma2 expressed in LTK cells preincubated for 30 secs measured every 15 mins at -...
Ligand InfoPC cidPC sid
In DepthDetails ArticlePubMed
TargetGABA A receptor alpha-4/beta-3/gamma-2(Homo sapiens (Human))
Amgen
Curated by ChEMBL
LigandPNGBDBM50459882(CHEMBL4060185)
Affinity DataKi: >1.00E+4nM. Assay description: Displacement of [3H]Ro15-4313 from human GABAA receptor alpha4beta3gamma2 expressed in LTK cells preincubated for 30 secs measured every 15 mins at -...
Ligand InfoPC cidPC sid
In DepthDetails ArticlePubMed
TargetGABA-A receptor; alpha-2/beta-3/gamma-2(Homo sapiens (Human))
Amgen
Curated by ChEMBL
LigandPNGBDBM50459882(CHEMBL4060185)
Affinity DataKi: >1.00E+4nM. Assay description: Displacement of [3H]Ro15-1788 from human GABAA receptor alpha2beta3gamma2 expressed in LTK cells preincubated for 30 secs measured every 15 mins at -...
Ligand InfoPC cidPC sid
In DepthDetails ArticlePubMed