BDBM50461579 CHEMBL4227285
SMILES Fc1cccc(c1)-c1cnn2c1[nH]nc(-c1cc[nH]n1)c2=O
InChI Key InChIKey=XOBFTVGIIXQBGL-UHFFFAOYSA-N
Data  1 KI
  Tab Delimited (TSV)   2D SDfile   Computed 3D by Vconf -m prep SDfile
Find this compound or compounds like it in BindingDB:
Activity Spreadsheet -- Enzyme Inhibition Constant Data from BindingDB
Found 1 hit for monomerid = 50461579
TargetGamma-aminobutyric acid receptor subunit alpha-1/beta-2/gamma-2(Rattus norvegicus (Rat))
Universit£
Curated by ChEMBL
LigandPNGBDBM50461579(CHEMBL4227285)
Affinity DataKi:  100nM. Assay description: Displacement of [3H]Ro15-1788 from recombinant rat GABAAalpha1/beta2/gamma2 receptor after 90 mins by liquid scintillation counting method
Ligand InfoPC cidPC sid
In DepthDetails ArticlePubMed