BDBM50461592 CHEMBL4228929
SMILES Cc1ccc2n(Cc3ccccc3[N+]([O-])=O)cc(CN3CCCCC3)c2c1
InChI Key InChIKey=VQZFIBLXQDWSBN-UHFFFAOYSA-N
Data  1 IC50
  Tab Delimited (TSV)   2D SDfile   Computed 3D by Vconf -m prep SDfile
Find this compound or compounds like it in BindingDB:
Activity Spreadsheet -- Enzyme Inhibition Constant Data from BindingDB
Found 1 hit for monomerid = 50461592
TargetVoltage-dependent L-type calcium channel subunit alpha-1F(Homo sapiens (Human))
Universidad Aut£Noma De Madrid
Curated by ChEMBL
LigandPNGBDBM50461592(CHEMBL4228929)
Affinity DataIC50:  1.80E+3nM. Assay description: Inhibition of KCl-induced cytosolic voltage gated calcium channel opening in human SH-SY5Y cells by Fluo-4 AM dye based fluorescence assay
Ligand InfoPC cidPC sid
In DepthDetails ArticlePubMed