BDBM50461718 CHEMBL4227329
SMILES ONC(=O)C1CN(CCN1S(=O)(=O)c1ccccc1)C(=O)c1ccccc1Br
InChI Key InChIKey=FZBQPTGPOKWUIP-UHFFFAOYSA-N
Data  1 IC50
  Tab Delimited (TSV)   2D SDfile   Computed 3D by Vconf -m prep SDfile
Find this compound or compounds like it in BindingDB:
Activity Spreadsheet -- Enzyme Inhibition Constant Data from BindingDB
Found 1 hit for monomerid = 50461718
TargetFalcilysin(Plasmodium falciparum (isolate 3D7))
California State University
Curated by ChEMBL
LigandPNGBDBM50461718(CHEMBL4227329)
Affinity DataIC50:  7.00E+3nM. Assay description: Inhibition of Plasmodium falciparum 3D7 FLN (55 to 1193 residues) expressed in Escherichia coli BL21 using Dabcyl-HKRHSFRMRG-EDANS as substrate prein...
Ligand InfoPC cidPC sid
In DepthDetails ArticlePubMed