BDBM50461724 CHEMBL4228556
SMILES COc1ccc(cc1)S(=O)(=O)N1CCN(CC1C(=O)NO)C(=O)c1ccccc1Br
InChI Key InChIKey=LPZWRDQPZQYVPW-UHFFFAOYSA-N
Data  1 IC50
  Tab Delimited (TSV)   2D SDfile   Computed 3D by Vconf -m prep SDfile
Find this compound or compounds like it in BindingDB:
Activity Spreadsheet -- Enzyme Inhibition Constant Data from BindingDB
Found 1 hit for monomerid = 50461724
TargetFalcilysin(Plasmodium falciparum (isolate 3D7))
California State University
Curated by ChEMBL
LigandPNGBDBM50461724(CHEMBL4228556)
Affinity DataIC50:  8.00E+3nM. Assay description: Inhibition of Plasmodium falciparum 3D7 FLN (55 to 1193 residues) expressed in Escherichia coli BL21 using Dabcyl-HKRHSFRMRG-EDANS as substrate prein...
Ligand InfoPC cidPC sid
In DepthDetails ArticlePubMed