BDBM50461726 CHEMBL4228497
SMILES COc1ccc(cc1)S(=O)(=O)N1CCN(CC1C(=O)NO)C(=O)c1ccc(Cl)c(Cl)c1
InChI Key InChIKey=KGFVVSBVXSOLDX-UHFFFAOYSA-N
Data  1 IC50
  Tab Delimited (TSV)   2D SDfile   Computed 3D by Vconf -m prep SDfile
Find this compound or compounds like it in BindingDB:
Activity Spreadsheet -- Enzyme Inhibition Constant Data from BindingDB
Found 1 hit for monomerid = 50461726
TargetFalcilysin(Plasmodium falciparum (isolate 3D7))
California State University
Curated by ChEMBL
LigandPNGBDBM50461726(CHEMBL4228497)
Affinity DataIC50:  6.00E+3nM. Assay description: Inhibition of Plasmodium falciparum 3D7 FLN (55 to 1193 residues) expressed in Escherichia coli BL21 using Dabcyl-HKRHSFRMRG-EDANS as substrate prein...
Ligand InfoPC cidPC sid
In DepthDetails ArticlePubMed