BDBM50462450 CHEMBL4238712
SMILES FC(F)(C(NS(=O)(=O)c1ccccc1)c1ccccc1)C(=O)c1ccc2ccccc2c1
InChI Key InChIKey=UENHWLHPOKTWPL-UHFFFAOYSA-N
Data  2 EC50
  Tab Delimited (TSV)   2D SDfile   Computed 3D by Vconf -m prep SDfile
Find this compound or compounds like it in BindingDB:
Activity Spreadsheet -- Enzyme Inhibition Constant Data from BindingDB
Found 2 hits for monomerid = 50462450
TargetGamma-aminobutyric acid receptor subunit alpha-1/beta-2/gamma-2(Rattus norvegicus (Rat))
University Of Mississippi
Curated by ChEMBL
LigandPNGBDBM50462450(CHEMBL4238712)
Affinity DataEC50: >1.00E+5nM. Assay description: Agonist activity at rat GFP-fused GABA-A alpha1/beta2/gamma2 receptor expressed in human tsA201 cells at -60 mV holding potential by whole-cell volta...
Ligand InfoPC cidPC sid
In DepthDetails ArticlePubMed
TargetGamma-aminobutyric acid receptor subunit beta-1/beta-2(Homo sapiens (Human))
University Of Mississippi
Curated by ChEMBL
LigandPNGBDBM50462450(CHEMBL4238712)
Affinity DataEC50:  3.27E+4nM. Assay description: Agonist activity at human GABA-B1/B2 receptor expressed in HEK293/Cre-luc cells assessed as inhibition of forskolin-stimulated cAMP accumulation afte...
Ligand InfoPC cidPC sid
In DepthDetails ArticlePubMed