BDBM50462453 CHEMBL4244933
SMILES OC(c1ccccc1)C(F)(F)C(=O)C12CC3CC(CC(C3)C1)C2
InChI Key InChIKey=RRMSGFQOMZBFTH-UHFFFAOYSA-N
Data  1 EC50
  Tab Delimited (TSV)   2D SDfile   Computed 3D by Vconf -m prep SDfile
Find this compound or compounds like it in BindingDB:
Activity Spreadsheet -- Enzyme Inhibition Constant Data from BindingDB
Found 1 hit for monomerid = 50462453
TargetGamma-aminobutyric acid receptor subunit beta-1/beta-2(Homo sapiens (Human))
University Of Mississippi
Curated by ChEMBL
LigandPNGBDBM50462453(CHEMBL4244933)
Affinity DataEC50: >1.00E+5nM. Assay description: Agonist activity at human GABA-B1/B2 receptor expressed in HEK293/Cre-luc cells assessed as inhibition of forskolin-stimulated cAMP accumulation afte...
Ligand InfoPC cidPC sid
In DepthDetails ArticlePubMed