BDBM50463416 CHEMBL4245455
SMILES CCS(=O)(=O)N1CCN(CC1)c1ncnc2n(c(nc12)-c1ccccc1Cl)-c1ccc(Cl)cc1
InChI Key InChIKey=CWCYGDHBLLGUKT-UHFFFAOYSA-N
Data  2 KI
  Tab Delimited (TSV)   2D SDfile   Computed 3D by Vconf -m prep SDfile
Find this compound or compounds like it in BindingDB:
Activity Spreadsheet -- Enzyme Inhibition Constant Data from BindingDB
Found 2 hits for monomerid = 50463416
TargetCannabinoid receptor 1(Homo sapiens (Human))
Rti International
Curated by ChEMBL
LigandPNGBDBM50463416(CHEMBL4245455)
Affinity DataKi:  3nM. Assay description: Displacement of [3H]-CP55940 from human CB1 receptor expressed in HEK293 cell membranes after 1 hr by liquid scintillation spectrometry
Ligand InfoPC cidPC sid
In DepthDetails ArticlePubMed
TargetCannabinoid receptor 2(Homo sapiens (Human))
Rti International
Curated by ChEMBL
LigandPNGBDBM50463416(CHEMBL4245455)
Affinity DataKi:  980nM. Assay description: Displacement of [3H]-CP55940 from human CB2 receptor expressed in HEK293 cell membranes after 1 hr by liquid scintillation spectrometry
Ligand InfoPC cidPC sid
In DepthDetails ArticlePubMed