BDBM50463785 CHEMBL4238778
SMILES [H][C@]12CC(C)=CC[C@]1([H])C(C)(C)Oc1cc(cc(O)c21)C(\C)=N/OC(C)CCC
InChI Key InChIKey=JVMFOJRWOSFHAK-UVPIQSCXSA-N
Data  3 KI  1 EC50
  Tab Delimited (TSV)   2D SDfile   Computed 3D by Vconf -m prep SDfile
Find this compound or compounds like it in BindingDB:
Activity Spreadsheet -- Enzyme Inhibition Constant Data from BindingDB
Found 4 hits for monomerid = 50463785
TargetCannabinoid receptor 1(Rattus norvegicus (rat))
Northeastern University
Curated by ChEMBL
LigandPNGBDBM50463785(CHEMBL4238778)
Affinity DataKi:  0.5nM. Assay description: Displacement of [3H]CP-55,940 from rat brain Cb1 receptor
Ligand InfoPC cidPC sid
In DepthDetails ArticlePubMed
TargetCannabinoid receptor 2(MOUSE)
Northeastern University
Curated by ChEMBL
LigandPNGBDBM50463785(CHEMBL4238778)
Affinity DataKi:  1.90nM. Assay description: Displacement of [3H]CP-55,940 from recombinant mouse Cb2 receptor expressed in HEK293 cells
Ligand InfoPC cidPC sid
In DepthDetails ArticlePubMed
TargetCannabinoid receptor 2(Homo sapiens (Human))
Northeastern University
Curated by ChEMBL
LigandPNGBDBM50463785(CHEMBL4238778)
Affinity DataKi:  6.10nM. Assay description: Displacement of [3H]CP-55,940 from recombinant human Cb2 receptor expressed in HEK293 cells
Ligand InfoPC cidPC sid
In DepthDetails ArticlePubMed
TargetCannabinoid receptor 2(Homo sapiens (Human))
Northeastern University
Curated by ChEMBL
LigandPNGBDBM50463785(CHEMBL4238778)
Affinity DataEC50:  12nM. Assay description: Agonist activity at recombinant human Cb2 receptor expressed in HEK293 cells assessed as inhibition of forskolin-stimulated cAMP levels
Ligand InfoPC cidPC sid
In DepthDetails ArticlePubMed