BDBM50464399 CHEMBL4278446
SMILES CCCNC(=O)NCC1CCc2ccc3ccc(OC)nc3c12
InChI Key InChIKey=DCMXVAZTUHQTTP-UHFFFAOYSA-N
Data  3 KI  1 EC50
  Tab Delimited (TSV)   2D SDfile   Computed 3D by Vconf -m prep SDfile
Find this compound or compounds like it in BindingDB:
Activity Spreadsheet -- Enzyme Inhibition Constant Data from BindingDB
Found 4 hits for monomerid = 50464399
TargetMelatonin receptor type 1B(Homo sapiens (Human))
Univ. Lille
Curated by ChEMBL
LigandPNGBDBM50464399(CHEMBL4278446)
Affinity DataKi:  0.400nM. Assay description: Displacement of 2-[125I]iodomelatonin from human MT2 receptor expressed in CHO cell membranes after 120 mins by filter binding method
Ligand InfoPC cidPC sid
In DepthDetails ArticlePubMed
TargetMelatonin receptor type 1A(Homo sapiens (Human))
Univ. Lille
Curated by ChEMBL
LigandPNGBDBM50464399(CHEMBL4278446)
Affinity DataKi:  7nM. Assay description: Displacement of 2-[125I]iodomelatonin from human MT1 receptor expressed in CHO cell membranes after 120 mins by filter binding method
Ligand InfoPC cidPC sid
In DepthDetails ArticlePubMed
Target5-hydroxytryptamine receptor 2C(Homo sapiens (Human))
Univ. Lille
Curated by ChEMBL
LigandPNGBDBM50464399(CHEMBL4278446)
Affinity DataKi:  285nM. Assay description: Displacement of [3H]-mesulergine from human 5-HT2C receptor expressed in CHO cell membranes after 60 mins by TopCount scintillation counting method
Ligand InfoPC cidPC sid
In DepthDetails ArticlePubMed
TargetMelatonin receptor type 1A(Homo sapiens (Human))
Univ. Lille
Curated by ChEMBL
LigandPNGBDBM50464399(CHEMBL4278446)
Affinity DataEC50:  0.900nM. Assay description: Agonist activity at human MT1 receptor expressed in CHO cell membranes after 1 hr by [35S]GTPgammaS binding assay
Ligand InfoPC cidPC sid
In DepthDetails ArticlePubMed