BDBM50464587 CHEMBL4294180
SMILES Cc1cn(CCCCCCOc2ccc3ccc(=O)oc3c2)cn1
InChI Key InChIKey=VKJQZIDTPQRGJH-UHFFFAOYSA-N
Data  1 IC50
  Tab Delimited (TSV)   2D SDfile   Computed 3D by Vconf -m prep SDfile
Find this compound or compounds like it in BindingDB:
Activity Spreadsheet -- Enzyme Inhibition Constant Data from BindingDB
Found 1 hit for monomerid = 50464587
TargetEnoyl-(Acyl-carrier-protein) reductase II(Streptococcus agalactiae serotype V (strain ATCC B...)
Northwest A&F University
Curated by ChEMBL
LigandPNGBDBM50464587(CHEMBL4294180)
Affinity DataIC50:  3.59E+3nM. Assay description: Inhibition of Streptococcus agalactiae WB1445 FabK in presence of t-O-NAC and NADH up to 1 min by spectrophotometric analysis
Ligand InfoPC cidPC sid
In DepthDetails ArticlePubMed