BDBM50464747 CHEMBL4287056
SMILES O=C(CN1CCCCC1)Nc1cc(-c2ccco2)c2oc(nc2c1)-c1ccco1
InChI Key InChIKey=HGXZSQKJGZKRPF-UHFFFAOYSA-N
Data  1 KI  1 IC50
  Tab Delimited (TSV)   2D SDfile   Computed 3D by Vconf -m prep SDfile
Find this compound or compounds like it in BindingDB:
Activity Spreadsheet -- Enzyme Inhibition Constant Data from BindingDB
Found 2 hits for monomerid = 50464747
TargetAdenosine receptor A2a(Homo sapiens (Human))
Umr-S1172 - Jparc - Centre De Recherche Jean-Pierre Aubert Neurosciences Et Cancer
Curated by ChEMBL
LigandPNGBDBM50464747(CHEMBL4287056)
Affinity DataKi:  210nM. Assay description: Displacement of [3H]-ZM241385 from human adenosine A2A receptor expressed in CHO cell membranes after 1 hr by TopCount microplate scintillation count...
Ligand InfoPC cidPC sid
In DepthDetails ArticlePubMed
TargetAdenosine receptor A2a(Homo sapiens (Human))
Umr-S1172 - Jparc - Centre De Recherche Jean-Pierre Aubert Neurosciences Et Cancer
Curated by ChEMBL
LigandPNGBDBM50464747(CHEMBL4287056)
Affinity DataIC50:  486nM. Assay description: Antagonist activity at human adenosine A2A receptor expressed in HEK293 cell membranes assessed as inhibition of CGS241680-induced [35S]GTPgammaS bin...
Ligand InfoPC cidPC sid
In DepthDetails ArticlePubMed