BDBM50464860 CHEMBL4294729
SMILES C(Cc1cc2ccccc2o1)N1CCN(CC1)c1ccccc1-c1ccccc1
InChI Key InChIKey=UTXCJYGRQJACJM-UHFFFAOYSA-N
Data  1 IC50
  Tab Delimited (TSV)   2D SDfile   Computed 3D by Vconf -m prep SDfile
Find this compound or compounds like it in BindingDB:
Activity Spreadsheet -- Enzyme Inhibition Constant Data from BindingDB
Found 1 hit for monomerid = 50464860
TargetSodium-dependent serotonin transporter(Rattus norvegicus (rat))
Shanghai Institute Of Pharmaceutical Industry
Curated by ChEMBL
LigandPNGBDBM50464860(CHEMBL4294729)
Affinity DataIC50:  2.90E+3nM. Assay description: Inhibition of [3H]serotonin reuptake in rat brain synaptosomes SERT after 15 mins by TopCount scintillation counting method
Ligand InfoPC cidPC sid
In DepthDetails ArticlePubMed