BDBM50465021 CHEMBL4292807
SMILES Oc1ccc2n(CCN3CCOCC3)cc(C(=O)C3CCCCC3)c2c1
InChI Key InChIKey=FVQYDNJMRKXPES-UHFFFAOYSA-N
Data  2 KI  1 EC50
  Tab Delimited (TSV)   2D SDfile   Computed 3D by Vconf -m prep SDfile
Find this compound or compounds like it in BindingDB:
Activity Spreadsheet -- Enzyme Inhibition Constant Data from BindingDB
Found 3 hits for monomerid = 50465021
TargetCannabinoid receptor 2(Homo sapiens (Human))
University Of Otago
Curated by ChEMBL
LigandPNGBDBM50465021(CHEMBL4292807)
Affinity DataKi:  895nM. Assay description: Displacement of [3H]CP55,940 from N-terminal HA-tagged human CB2 receptor expressed in HEK293 cell membranes after 1 hr by microbeta scintillation co...
Ligand InfoPC cidPC sid
In DepthDetails ArticlePubMed
TargetCannabinoid receptor 1(Homo sapiens (Human))
University Of Otago
Curated by ChEMBL
LigandPNGBDBM50465021(CHEMBL4292807)
Affinity DataKi: >1.00E+4nM. Assay description: Displacement of [3H]CP55,940 from N-terminal HA-tagged human CB1 receptor expressed in HEK293 cell membranes after 1 hr by microbeta scintillation co...
Ligand InfoPC cidPC sid
In DepthDetails ArticlePubMed
TargetCannabinoid receptor 2(Homo sapiens (Human))
University Of Otago
Curated by ChEMBL
LigandPNGBDBM50465021(CHEMBL4292807)
Affinity DataEC50:  19nM. Assay description: Agonist activity at N-terminal HA-tagged human CB2 receptor expressed in HEK293 cells transfected with YFP-Epac-RLuc assessed as decrease in forskoli...
Ligand InfoPC cidPC sid
In DepthDetails ArticlePubMed