BDBM50465043 CHEMBL4278012
SMILES COc1ccc(cc1)C(=O)c1cn(CCN2CCOCC2)c2ccc(OCC(=O)NCCOCCOCCNC(=O)CCCCCNC(=O)COc3ccc(\C=C\C4=[N+]5C(C=C4)=Cc4ccc(-c6cccs6)n4[B-]5(F)F)cc3)cc12
InChI Key InChIKey=RNWLOBZNALLKCG-MDWZMJQESA-N
Data  1 KI
  Tab Delimited (TSV)   2D SDfile   Computed 3D by Vconf -m prep SDfile
Find this compound or compounds like it in BindingDB:
Activity Spreadsheet -- Enzyme Inhibition Constant Data from BindingDB
Found 1 hit for monomerid = 50465043
TargetCannabinoid receptor 2(Homo sapiens (Human))
University Of Otago
Curated by ChEMBL
LigandPNGBDBM50465043(CHEMBL4278012)
Affinity DataKi: >1.00E+4nM. Assay description: Displacement of [3H]CP55,940 from N-terminal HA-tagged human CB2 receptor expressed in HEK293 cell membranes after 1 hr by microbeta scintillation co...
Ligand InfoPC cidPC sid
In DepthDetails ArticlePubMed