BDBM50465109 CHEMBL4286199
SMILES CC(=O)N[C@H]1CC[C@@H](CC1)Nc1nccc(n1)-c1c(C)onc1-c1ccccc1
InChI Key InChIKey=DLNGCNBJNSICSI-IYARVYRRSA-N
Data  2 IC50
  Tab Delimited (TSV)   2D SDfile   Computed 3D by Vconf -m prep SDfile
Find this compound or compounds like it in BindingDB:
Activity Spreadsheet -- Enzyme Inhibition Constant Data from BindingDB
Found 2 hits for monomerid = 50465109
TargetMitogen-activated protein kinase 14(Homo sapiens (Human))
Montclair State University
Curated by ChEMBL
LigandPNGBDBM50465109(CHEMBL4286199)
Affinity DataIC50:  26nM. Assay description: Inhibition of human p38alpha using FAM-p38tide as substrate by IMAP assay
Ligand InfoPC cidPC sid
In DepthDetails ArticlePubMed
TargetMitogen-activated protein kinase 8(Homo sapiens (Human))
Montclair State University
Curated by ChEMBL
LigandPNGBDBM50465109(CHEMBL4286199)
Affinity DataIC50:  170nM. Assay description: Inhibition of human JNK1a1 FAM-EGFR-derived peptide as substrate by IMAP assay
Ligand InfoPC cidPC sid
In DepthDetails ArticlePubMed