BDBM50465325 CHEMBL4284923
SMILES [H][C@](O[C@@H]1O[C@H](CNC(C)=O)[C@@H](O)[C@H]1OC)([C@H](NCCCNC(=O)[C@@H](NC(=O)[C@@H](NC(=O)N[C@@H](C(C)C)C(O)=O)[C@]1([H])CCNC(=N)N1)[C@@H](O)C(C)C)C(O)=O)[C@@]1([H])O[C@H]([C@H](O)[C@@H]1O)n1ccc(=O)[nH]c1=O
InChI Key InChIKey=ZLESIXPPLUNLCM-YUSYNUEUSA-N
Data  2 IC50
  Tab Delimited (TSV)   2D SDfile   Computed 3D by Vconf -m prep SDfile
Find this compound or compounds like it in BindingDB:
Activity Spreadsheet -- Enzyme Inhibition Constant Data from BindingDB
Found 2 hits for monomerid = 50465325
TargetPhospho-N-acetylmuramoyl-pentapeptide-transferase(Aquifex aeolicus (strain VF5))
Nanjing University Of Chinese Medicine
Curated by ChEMBL
LigandPNGBDBM50465325(CHEMBL4284923)
Affinity DataIC50:  1.80nM. Assay description: Inhibition of Aquifex aeolicus MraY expressed in Escherichia coli C41(DE3) using Park's nucleotide as substrate pretreated for 30 mins followed by su...
Ligand InfoPC cidPC sid
In DepthDetails ArticlePubMed
TargetPhospho-N-acetylmuramoyl-pentapeptide-transferase(Staphylococcus aureus (strain MRSA252))
Nanjing University Of Chinese Medicine
Curated by ChEMBL
LigandPNGBDBM50465325(CHEMBL4284923)
Affinity DataIC50:  0.0930nM. Assay description: Inhibition of Staphylococcus aureus MraY expressed in Escherichia coli membrane using Park's nucleotide as substrate pretreated for 30 mins followed ...
Ligand InfoPC cidPC sid
In DepthDetails ArticlePubMed