BDBM50465341 CHEMBL4289234
SMILES [H][C@@]12CCc3cc(O)ccc3[C@@]1(C)CCC[C@@]2(CC(=O)OC)C(O)=O
InChI Key InChIKey=YIWVPLFQLSSHNE-LZQZEXGQSA-N
Data  2 IC50
  Tab Delimited (TSV)   2D SDfile   Computed 3D by Vconf -m prep SDfile
Find this compound or compounds like it in BindingDB:
Activity Spreadsheet -- Enzyme Inhibition Constant Data from BindingDB
Found 2 hits for monomerid = 50465341
TargetLysine--tRNA ligase(Homo sapiens (Human))
Yunnan University
Curated by ChEMBL
LigandPNGBDBM50465341(CHEMBL4289234)
Affinity DataIC50: >100nM. Assay description: Inhibition of SYK (unknown origin) by mobility shift assay
Ligand InfoPC cidPC sid
In DepthDetails ArticlePubMed
TargetTyrosine-protein kinase JAK3(Homo sapiens (Human))
Yunnan University
Curated by ChEMBL
LigandPNGBDBM50465341(CHEMBL4289234)
Affinity DataIC50: >100nM. Assay description: Inhibition of JAK3 (unknown origin) by mobility shift assay
Ligand InfoPC cidPC sid
In DepthDetails ArticlePubMed