BDBM50465362 CHEMBL4286544
SMILES CNc1nc(Nc2ccc(c(F)c2)-n2cnc(C)n2)nc2N(CCC(C)(C)c12)c1ccc(F)cc1
InChI Key InChIKey=LLCQLIVLLRLJSJ-UHFFFAOYSA-N
Data  1 EC50
  Tab Delimited (TSV)   2D SDfile   Computed 3D by Vconf -m prep SDfile
Find this compound or compounds like it in BindingDB:
Activity Spreadsheet -- Enzyme Inhibition Constant Data from BindingDB
Found 1 hit for monomerid = 50465362
TargetPresenilin-1(Homo sapiens (Human))
Temple University School Of Pharmacy
Curated by ChEMBL
LigandPNGBDBM50465362(CHEMBL4286544)
Affinity DataEC50:  8nM. Assay description: Inhibition of gamma-secretase in human H4 cells harboring APP695 K595N/M596L swedish mutant after 24 hrs by AlphaLisa assay
Ligand InfoPC cidPC sid
In DepthDetails ArticlePubMed