BDBM50465479 CHEMBL4286709
SMILES Nc1ccc[nH]c1=O
InChI Key InChIKey=VTSFNCCQCOEPKF-UHFFFAOYSA-N
Data  3 KI
  Tab Delimited (TSV)   2D SDfile   Computed 3D by Vconf -m prep SDfile
Find this compound or compounds like it in BindingDB:
Activity Spreadsheet -- Enzyme Inhibition Constant Data from BindingDB
Found 3 hits for monomerid = 50465479
TargetAurora kinase B/Inner centromere protein(Homo sapiens (Human))
The Institute Of Cancer Research
Curated by ChEMBL
LigandPNGBDBM50465479(CHEMBL4286709)
Affinity DataKi:  1.60E+5nM. Assay description: Inhibition of human full length N-terminal GST-tagged Aurora B (1 to 344 end residues)/His-tagged INCENP (803 to 918 end residues) expressed in bacul...
In DepthDetails ArticlePubMed
TargetAurora kinase A(Homo sapiens (Human))
The Institute Of Cancer Research
Curated by ChEMBL
LigandPNGBDBM50465479(CHEMBL4286709)
Affinity DataKi:  3.61E+5nM. Assay description: Inhibition of full length N-terminal His-tagged Aurora A (unknown origin) using fluorescence-labeled FL-Peptide 21 as substrate after 60 mins in pres...
In DepthDetails ArticlePubMed
TargetDual specificity protein kinase TTK(Homo sapiens (Human))
The Institute Of Cancer Research
Curated by ChEMBL
LigandPNGBDBM50465479(CHEMBL4286709)
Affinity DataKi: >1.00E+6nM. Assay description: Inhibition of full length human Mps1 using fluorescence-labeled H236 peptide as substrate after 60 to 90 mins in presence of ATP by fluorescence assa...
In DepthDetails ArticlePubMed