BDBM50465493 CHEMBL4281678
SMILES Fc1cccc(c1)C(=O)Nc1cc(c[nH]c1=O)-c1ccncc1
InChI Key InChIKey=MKYJMYGYSKQKEA-UHFFFAOYSA-N
Data  3 KI
  Tab Delimited (TSV)   2D SDfile   Computed 3D by Vconf -m prep SDfile
Find this compound or compounds like it in BindingDB:
Activity Spreadsheet -- Enzyme Inhibition Constant Data from BindingDB
Found 3 hits for monomerid = 50465493
TargetDual specificity protein kinase TTK(Homo sapiens (Human))
The Institute Of Cancer Research
Curated by ChEMBL
LigandPNGBDBM50465493(CHEMBL4281678)
Affinity DataKi: >1.00E+5nM. Assay description: Inhibition of full length human Mps1 using fluorescence-labeled H236 peptide as substrate after 60 to 90 mins in presence of ATP by fluorescence assa...
Ligand InfoPC cidPC sid
In DepthDetails ArticlePubMed
TargetAurora kinase A(Homo sapiens (Human))
The Institute Of Cancer Research
Curated by ChEMBL
LigandPNGBDBM50465493(CHEMBL4281678)
Affinity DataKi: >1.00E+5nM. Assay description: Inhibition of full length N-terminal His-tagged Aurora A (unknown origin) using fluorescence-labeled FL-Peptide 21 as substrate after 60 mins in pres...
Ligand InfoPC cidPC sid
In DepthDetails ArticlePubMed
TargetAurora kinase B/Inner centromere protein(Homo sapiens (Human))
The Institute Of Cancer Research
Curated by ChEMBL
LigandPNGBDBM50465493(CHEMBL4281678)
Affinity DataKi: >1.00E+5nM. Assay description: Inhibition of human full length N-terminal GST-tagged Aurora B (1 to 344 end residues)/His-tagged INCENP (803 to 918 end residues) expressed in bacul...
Ligand InfoPC cidPC sid
In DepthDetails ArticlePubMed