BDBM50465598 CHEMBL4289405
SMILES O=C(NCc1cccc(c1)-c1cn2CCCc2n1)C1CCCCC1
InChI Key InChIKey=GZZSSYVKMPAQRS-UHFFFAOYSA-N
Data  1 KI
  Tab Delimited (TSV)   2D SDfile   Computed 3D by Vconf -m prep SDfile
Find this compound or compounds like it in BindingDB:
Activity Spreadsheet -- Enzyme Inhibition Constant Data from BindingDB
Found 1 hit for monomerid = 50465598
TargetWD repeat-containing protein 5(Homo sapiens (Human))
TBA
Curated by ChEMBL
LigandPNGBDBM50465598(CHEMBL4289405)
Affinity DataKi:  7.54E+3nM. Assay description: Binding affinity to N-terminal 6x-His-SUMO tagged WDR5 delta23 deletion mutant (24 to 334 residues) (unknown origin) expressed in Escherichia coli BL...
Ligand InfoPC cidPC sid
In DepthDetails ArticlePubMed