BDBM50466069 CHEMBL4284306
SMILES CCC(C)n1ncn(-c2ccc(cc2)N2CCN(CC2)c2ccc(OC[C@@H]3CO[C@](Cn4cnnn4)(O3)c3ccc(Cl)cc3Cl)cc2)c1=O
InChI Key InChIKey=WHQYAUJFJVHMCU-ZOTGSTGKSA-N
Data  1 EC50
  Tab Delimited (TSV)   2D SDfile   Computed 3D by Vconf -m prep SDfile
Find this compound or compounds like it in BindingDB:
Activity Spreadsheet -- Enzyme Inhibition Constant Data from BindingDB
Found 1 hit for monomerid = 50466069
TargetCytochrome P450 3A4(Homo sapiens (Human))
TBA
Curated by ChEMBL
LigandPNGBDBM50466069(CHEMBL4284306)
Affinity DataEC50: >2.00E+4nM. Assay description: Inhibition of human liver microsome CYP3A4 expressed in baculosomes using fluorogenic-DBOMF as substrate preincubated for 10 mins followed by substra...
Ligand InfoPC cidPC sid
In DepthDetails ArticlePubMed