BDBM50466177 CHEMBL4284416
SMILES CCCCCCCCCCCCCCCCCCC\C=C\C(O)=O
InChI Key InChIKey=ATNNLHXCRAAGJS-QZQOTICOSA-N
Data  1 IC50
  Tab Delimited (TSV)   2D SDfile   Computed 3D by Vconf -m prep SDfile
Find this compound or compounds like it in BindingDB:
Activity Spreadsheet -- Enzyme Inhibition Constant Data from BindingDB
Found 1 hit for monomerid = 50466177
TargetAcetylcholinesterase(Electrophorus electricus (Electric eel))
Martin-Luther-University Halle-Wittenberg
Curated by ChEMBL
LigandPNGBDBM50466177(CHEMBL4284416)
Affinity DataIC50:  1.17E+4nM. Assay description: Inhibition of electric eel AChE using acetylthiocholine iodide as substrate preincubated for 20 mins followed by substrate addition and measured at 1...
Ligand InfoPC cidPC sid
In DepthDetails ArticlePubMed