BDBM50466202 CHEMBL4278321
SMILES NC(=O)c1ccc(nc1Nc1ccc(cc1)N1CCCCC1)N1CC[C@@H](C1)NC(=O)C=C
InChI Key InChIKey=SOHHRLZEAIOYKA-SFHVURJKSA-N
Data  2 IC50
  Tab Delimited (TSV)   2D SDfile   Computed 3D by Vconf -m prep SDfile
Find this compound or compounds like it in BindingDB:
Activity Spreadsheet -- Enzyme Inhibition Constant Data from BindingDB
Found 2 hits for monomerid = 50466202
TargetTyrosine-protein kinase BTK(Homo sapiens (Human))
Emd Serono Research & Development Institute
Curated by ChEMBL
LigandPNGBDBM50466202(CHEMBL4278321)
Affinity DataIC50:  1.30nM. Assay description: Inhibition of full length human BTK (8 to 80 residues) using FITC-AHA-EEPLYWSFPAKKK-NH2 as substrate after 90 mins by off-chip mobility shift assay
Ligand InfoPC cidPC sid
In DepthDetails ArticlePubMed
TargetPotassium voltage-gated channel subfamily H member 2(Homo sapiens (Human))
Emd Serono Research & Development Institute
Curated by ChEMBL
LigandPNGBDBM50466202(CHEMBL4278321)
Affinity DataIC50:  3.30E+3nM. Assay description: Inhibition of human ERG
Ligand InfoPC cidPC sid
In DepthDetails ArticlePubMed