BDBM50466408 CHEMBL4295049
SMILES NS(=O)(=O)C[C@@H]1[C@@H](O)[C@H](O)[C@@H](CO)O[C@H]1OCc1ccccc1
InChI Key InChIKey=AOHIGESULYFOOP-DHGKCCLASA-N
Data  2 IC50
  Tab Delimited (TSV)   2D SDfile   Computed 3D by Vconf -m prep SDfile
Find this compound or compounds like it in BindingDB:
Activity Spreadsheet -- Enzyme Inhibition Constant Data from BindingDB
Found 2 hits for monomerid = 50466408
TargetPoly-beta-1,6-N-acetyl-D-glucosamine N-deacetylase(Escherichia coli (Enterobacteria))
University Of Toronto
Curated by ChEMBL
LigandPNGBDBM50466408(CHEMBL4295049)
Affinity DataIC50: >1.00E+7nM. Assay description: Inhibition of Escherichia coli PgaB expressed in Escherichia coli BL21 (DE3) cells transformed with pET28 plasmid coding for PgaB42-655 using acetoxy...
Ligand InfoPC cidPC sid
In DepthDetails ArticlePubMed
TargetPeptidoglycan-N-acetylglucosamine deacetylase(Streptococcus pneumoniae (Firmicutes))
University Of Toronto
Curated by ChEMBL
LigandPNGBDBM50466408(CHEMBL4295049)
Affinity DataIC50: >1.00E+7nM. Assay description: Inhibition of Streptococcus pneumoniae Pgda expressed in Escherichia coli BL21 (DE3) cells transformed with pET28bSpPgdA232-431 plasmid using acetoxy...
Ligand InfoPC cidPC sid
In DepthDetails ArticlePubMed