BDBM50468751 CHEMBL4287823
SMILES CC(=O)NC1=NN(C(C)=O)C(C)(S1)c1ccsc1
InChI Key InChIKey=PBOLWEXTYJCIBM-UHFFFAOYSA-N
Data  1 IC50
  Tab Delimited (TSV)   2D SDfile   Computed 3D by Vconf -m prep SDfile
Find this compound or compounds like it in BindingDB:
Activity Spreadsheet -- Enzyme Inhibition Constant Data from BindingDB
Found 1 hit for monomerid = 50468751
TargetKinesin-like protein KIF11(Homo sapiens (Human))
University College London
Curated by ChEMBL
LigandPNGBDBM50468751(CHEMBL4287823)
Affinity DataIC50:  2.20E+3nM. Assay description: Inhibition of basal ATPase activity of N-terminal His6-tagged human Eg5 motor domain (1 to 368 residues) expressed in Escherichia coli BL21 (DE3) by ...
Ligand InfoPC cidPC sid
In DepthDetails ArticlePubMed