BDBM50468757 CHEMBL4288387
SMILES CC(=O)NC1=NN(C(C)=O)C(C)(S1)C1CCCCC1
InChI Key InChIKey=ILWIWPMPWGULPA-UHFFFAOYSA-N
Data  1 IC50
  Tab Delimited (TSV)   2D SDfile   Computed 3D by Vconf -m prep SDfile
Find this compound or compounds like it in BindingDB:
Activity Spreadsheet -- Enzyme Inhibition Constant Data from BindingDB
Found 1 hit for monomerid = 50468757
TargetKinesin-like protein KIF11(Homo sapiens (Human))
University College London
Curated by ChEMBL
LigandPNGBDBM50468757(CHEMBL4288387)
Affinity DataIC50:  7.50E+3nM. Assay description: Inhibition of basal ATPase activity of N-terminal His6-tagged human Eg5 motor domain (1 to 368 residues) expressed in Escherichia coli BL21 (DE3) by ...
Ligand InfoPC cidPC sid
In DepthDetails ArticlePubMed