BDBM50468860 CHEMBL1651645
SMILES CCOCn1c(Cc2ccccc2)c(C(C)C)c(=O)n(O)c1=O
InChI Key InChIKey=SJUZNBIKMRHZMQ-UHFFFAOYSA-N
Data  2 IC50
  Tab Delimited (TSV)   2D SDfile   Computed 3D by Vconf -m prep SDfile
Find this compound or compounds like it in BindingDB:
Activity Spreadsheet -- Enzyme Inhibition Constant Data from BindingDB
Found 2 hits for monomerid = 50468860
TargetReverse transcriptase(Human immunodeficiency virus 1)
University Of Minnesota
Curated by ChEMBL
LigandPNGBDBM50468860(CHEMBL1651645)
Affinity DataIC50:  1.30E+4nM. Assay description: Inhibition of HIV1 reverse transcriptase
Ligand InfoPC cidPC sid
In DepthDetails ArticlePubMed
TargetReverse transcriptase/RNaseH(Human immunodeficiency virus 1)
University Of Minnesota
Curated by ChEMBL
LigandPNGBDBM50468860(CHEMBL1651645)
Affinity DataIC50:  6.80E+3nM. Assay description: Inhibition of recombinant HIV1 reverse transcriptase RNase H expressed in Escherichia coli JM109 using RNA/DNA duplex substrate HTS1 as substrate
Ligand InfoPC cidPC sid
In DepthDetails ArticlePubMed