BDBM50471263 CHEMBL1627873
SMILES [H][C@@]12CC[C@H](O)[C@@]1(C)C[C@H](CCOS(C)(=O)=O)[C@]1([H])c3ccc(O)cc3CC[C@@]21[H]
InChI Key InChIKey=KSTBRFAYWXRXEX-NWSAAYAGSA-N
Data  1 EC50
  Tab Delimited (TSV)   2D SDfile   Computed 3D by Vconf -m prep SDfile
Find this compound or compounds like it in BindingDB:
Activity Spreadsheet -- Enzyme Inhibition Constant Data from BindingDB
Found 1 hit for monomerid = 50471263
TargetEstrogen receptor beta(Homo sapiens (Human))
Inserm Unit�
Curated by ChEMBL
LigandPNGBDBM50471263(CHEMBL1627873)
Affinity DataEC50:  6nM. Assay description: Compound concentration required to induce transcriptional activation in MVLN cells comparable to 50% of 0.1 nM estradiol response
Ligand InfoPC cidPC sid
In DepthDetails ArticlePubMed