BDBM50471846 CHEMBL434822
SMILES C(Nc1nc(nc2ccsc12)N1CCCCC1)c1ccccc1
InChI Key InChIKey=WTRJSVKSGFVZPG-UHFFFAOYSA-N
Data  2 IC50  1 EC50
  Tab Delimited (TSV)   2D SDfile   Computed 3D by Vconf -m prep SDfile
Find this compound or compounds like it in BindingDB:
Activity Spreadsheet -- Enzyme Inhibition Constant Data from BindingDB
Found 3 hits for monomerid = 50471846
TargetcAMP-specific 3',5'-cyclic phosphodiesterase 4A/4B/4C/4D(Homo sapiens (Human))
RhôNe-Poulenc Rorer
Curated by ChEMBL
LigandPNGBDBM50471846(CHEMBL434822)
Affinity DataEC50:  2.10E+4nM. Assay description: Increased cAMP accumulation in isoprenaline-induced guinea pig eosinophils
Ligand InfoPC cidPC sid
In DepthDetails ArticlePubMed
TargetcGMP-inhibited 3',5'-cyclic phosphodiesterase 3A/3B(Homo sapiens (Human))
RhôNe-Poulenc Rorer
Curated by ChEMBL
LigandPNGBDBM50471846(CHEMBL434822)
Affinity DataIC50: >2.00E+5nM. Assay description: Inhibitory activity against cGMP inhibited Phosphodiesterase 3, isolated from guinea pig ventricular tissue
Ligand InfoPC cidPC sid
In DepthDetails ArticlePubMed
TargetcAMP-specific 3',5'-cyclic phosphodiesterase 4A/4B/4C/4D(Homo sapiens (Human))
RhôNe-Poulenc Rorer
Curated by ChEMBL
LigandPNGBDBM50471846(CHEMBL434822)
Affinity DataIC50:  6.50E+4nM. Assay description: Inhibitory activity against phosphodiesterase 4 isolated from guinea pig ventricular tissue
Ligand InfoPC cidPC sid
In DepthDetails ArticlePubMed