BDBM50472810 CHEMBL3349326
SMILES C[C@@H]1CN(CCN1\C(Oc1ccccc1)=N\C#N)C(=O)[C@@](C)(O)C(F)(F)F
InChI Key InChIKey=PEMGMDPLDPXGEZ-AVAFYHMZSA-N
Data  1 IC50
  Tab Delimited (TSV)   2D SDfile   Computed 3D by Vconf -m prep SDfile
Find this compound or compounds like it in BindingDB:
Activity Spreadsheet -- Enzyme Inhibition Constant Data from BindingDB
Found 1 hit for monomerid = 50472810
Target[Pyruvate dehydrogenase (acetyl-transferring)] kinase isozyme 4, mitochondrial(Rattus norvegicus)
Novartis Institute For Biomedical Research
Curated by ChEMBL
LigandPNGBDBM50472810(CHEMBL3349326)
Affinity DataIC50:  49nM. Assay description: Inhibitory activity tested against Pyruvate Dehydrogenase Kinase (PDHK) receptor from rats.
Ligand InfoPC cidPC sid
In DepthDetails ArticlePubMed