BDBM50472825 CHEMBL81574
SMILES COC(=O)c1ccc(cc1)C(=O)N1C[C@H](C)N(C[C@H]1C)C(=O)[C@@](C)(O)C(F)(F)F
InChI Key InChIKey=PYKLJRYDQFJXIL-FTLABTOESA-N
Data  1 IC50
  Tab Delimited (TSV)   2D SDfile   Computed 3D by Vconf -m prep SDfile
Find this compound or compounds like it in BindingDB:
Activity Spreadsheet -- Enzyme Inhibition Constant Data from BindingDB
Found 1 hit for monomerid = 50472825
Target[Pyruvate dehydrogenase (acetyl-transferring)] kinase isozyme 4, mitochondrial(Rattus norvegicus)
Novartis Institute For Biomedical Research
Curated by ChEMBL
LigandPNGBDBM50472825(CHEMBL81574)
Affinity DataIC50:  19nM. Assay description: Inhibitory activity tested against Pyruvate Dehydrogenase Kinase (PDHK) receptor from rats.
Ligand InfoPC cidPC sid
In DepthDetails ArticlePubMed