BDBM50472841 CHEMBL443012
SMILES C[C@@H]1CN([C@@H](C)CN1C(=O)C1CCCCC1)C(=O)[C@@](C)(O)C(F)(F)F
InChI Key InChIKey=IFVNYUMVAGVLMH-BFQNTYOBSA-N
Data  1 IC50
  Tab Delimited (TSV)   2D SDfile   Computed 3D by Vconf -m prep SDfile
Find this compound or compounds like it in BindingDB:
Activity Spreadsheet -- Enzyme Inhibition Constant Data from BindingDB
Found 1 hit for monomerid = 50472841
Target[Pyruvate dehydrogenase (acetyl-transferring)] kinase isozyme 4, mitochondrial(Rattus norvegicus)
Novartis Institute For Biomedical Research
Curated by ChEMBL
LigandPNGBDBM50472841(CHEMBL443012)
Affinity DataIC50:  13nM. Assay description: Inhibitory activity tested against Pyruvate Dehydrogenase Kinase (PDHK) receptor from rats.
Ligand InfoPC cidPC sid
In DepthDetails ArticlePubMed