BDBM50472870 CHEMBL331975
SMILES CN(C)c1cccc(NC(=O)NC2C(=O)N(CCC(C)(C)C)c3ccccc3N(c3ccccc3)C2=O)c1
InChI Key InChIKey=MPSLKVRMDJEJGK-UHFFFAOYSA-N
Data  2 KI
  Tab Delimited (TSV)   2D SDfile   Computed 3D by Vconf -m prep SDfile
Find this compound or compounds like it in BindingDB:
Activity Spreadsheet -- Enzyme Inhibition Constant Data from BindingDB
Found 2 hits for monomerid = 50472870
TargetGastrin/cholecystokinin type B receptor(Homo sapiens (Human))
Glaxo Wellcome Medicines Research Centre
Curated by ChEMBL
LigandPNGBDBM50472870(CHEMBL331975)
Affinity DataKi:  0.302nM. Assay description: In vitro inhibition of binding of [3H]pCCK-8 against Cholecystokinin type B receptor of guinea pig cerebral cortex membranes
Ligand InfoPC cidPC sid
In DepthDetails ArticlePubMed
TargetCholecystokinin receptor type A(RAT)
Glaxo Wellcome Medicines Research Centre
Curated by ChEMBL
LigandPNGBDBM50472870(CHEMBL331975)
Affinity DataKi:  22nM. Assay description: In vitro inhibition of binding of [3H]pCCK-8 against Cholecystokinin type A receptor of rat pancreatic membranes
Ligand InfoPC cidPC sid
In DepthDetails ArticlePubMed