BDBM50472915 CHEMBL114036::MEN-11540
SMILES O=C1CC(Cc2ccccc2)C(=O)NCCNC(=O)[C@H](Cc2ccccc2)NC(=O)[C@H](Cc2c[nH]c3ccccc23)N1
InChI Key InChIKey=GMDUOTKYYRZGMU-UTARDKEYSA-N
Data  2 KI
  Tab Delimited (TSV)   2D SDfile   Computed 3D by Vconf -m prep SDfile
Find this compound or compounds like it in BindingDB:
Activity Spreadsheet -- Enzyme Inhibition Constant Data from BindingDB
Found 2 hits for monomerid = 50472915
TargetSubstance-K receptor(Homo sapiens (Human))
Menarini Ricerche
Curated by ChEMBL
LigandPNGBDBM50472915(CHEMBL114036 | MEN-11540)
Affinity DataKi:  794nM. Assay description: Binding affinity towards Tachykinin receptor 2
Ligand InfoPC cidPC sid
In DepthDetails ArticlePubMed
TargetSubstance-K receptor(Homo sapiens (Human))
Menarini Ricerche
Curated by ChEMBL
LigandPNGBDBM50472915(CHEMBL114036 | MEN-11540)
Affinity DataKi:  794nM. Assay description: Inhibitory affinity constant (pKi) against tachykinin receptor 2 (NK-2R) using heterologous competition experiments
Ligand InfoPC cidPC sid
In DepthDetails ArticlePubMed