BDBM50473303 CHEMBL542641
SMILES Cl.OC(=O)C1=CN(CCOCCC2c3ccccc3CCc3ccccc23)CCC1
InChI Key InChIKey=QKEYKXVKPFUMCG-UHFFFAOYSA-N
Data  1 IC50
  Tab Delimited (TSV)   2D SDfile   Computed 3D by Vconf -m prep SDfile
Find this compound or compounds like it in BindingDB:
Activity Spreadsheet -- Enzyme Inhibition Constant Data from BindingDB
Found 1 hit for monomerid = 50473303
TargetSodium- and chloride-dependent betaine transporter(Rattus norvegicus)
Novo Nordisk
Curated by ChEMBL
LigandPNGBDBM50473303(CHEMBL542641)
Affinity DataIC50:  1.20E+3nM. Assay description: In vitro inhibition of [3H]GABA uptake in rat synaptosomes was determined
Ligand InfoPC cidPC sid
In DepthDetails ArticlePubMed