BDBM50473311 CHEMBL543342
SMILES Cl.OC(=O)C1=CCCN(CCOCCN2c3ccccc3CCc3ccccc23)C1
InChI Key InChIKey=TVWXYLJYXTXZQK-UHFFFAOYSA-N
Data  1 IC50
  Tab Delimited (TSV)   2D SDfile   Computed 3D by Vconf -m prep SDfile
Find this compound or compounds like it in BindingDB:
Activity Spreadsheet -- Enzyme Inhibition Constant Data from BindingDB
Found 1 hit for monomerid = 50473311
TargetSodium- and chloride-dependent betaine transporter(Rattus norvegicus)
Novo Nordisk
Curated by ChEMBL
LigandPNGBDBM50473311(CHEMBL543342)
Affinity DataIC50:  644nM. Assay description: In vitro inhibition of [3H]GABA uptake in rat synaptosomes was determined
Ligand InfoPC cidPC sid
In DepthDetails ArticlePubMed