BDBM50473315 CHEMBL541561
SMILES Cl.[#8]-[#6](=O)-[#6@@H]-1-[#6]-[#6]-[#6]-[#7](-[#6]-[#6]-[#6]-[#8]-[#6]\[#6]=[#6]-2\c3ccccc3-[#6]-[#6]-c3ccccc-23)-[#6]-1
InChI Key InChIKey=KMRPZFKZVFBUIX-VZYDHVRKSA-N
Data  1 IC50
  Tab Delimited (TSV)   2D SDfile   Computed 3D by Vconf -m prep SDfile
Find this compound or compounds like it in BindingDB:
Activity Spreadsheet -- Enzyme Inhibition Constant Data from BindingDB
Found 1 hit for monomerid = 50473315
TargetSodium- and chloride-dependent betaine transporter(Rattus norvegicus)
Novo Nordisk
Curated by ChEMBL
LigandPNGBDBM50473315(CHEMBL541561)
Affinity DataIC50:  460nM. Assay description: In vitro inhibition of [3H]GABA uptake in rat synaptosomes was determined
Ligand InfoPC cidPC sid
In DepthDetails ArticlePubMed