BDBM50473686 CHEMBL433314
SMILES CNC(=O)[C@@H](NC(=O)[C@H](CC(C)C)[C@H](CO)C(=O)NO)C(C)(C)C
InChI Key InChIKey=MOODLLAARDEUNJ-GRYCIOLGSA-N
Data  4 KI  1 IC50
  Tab Delimited (TSV)   2D SDfile   Computed 3D by Vconf -m prep SDfile
Find this compound or compounds like it in BindingDB:
Activity Spreadsheet -- Enzyme Inhibition Constant Data from BindingDB
Found 5 hits for monomerid = 50473686
Target72 kDa type IV collagenase(Homo sapiens (Human))
Preclinical Research Novartis Pharma
Curated by ChEMBL
LigandPNGBDBM50473686(CHEMBL433314)
Affinity DataKi:  0.300nM. Assay description: Inhibitory potency against Matrix metalloprotease-2 (MMP-2)
Ligand InfoPC cidPC sid
In DepthDetails ArticlePubMed
TargetInterstitial collagenase(Homo sapiens (Human))
Preclinical Research Novartis Pharma
Curated by ChEMBL
LigandPNGBDBM50473686(CHEMBL433314)
Affinity DataKi:  0.600nM. Assay description: Inhibitory potency against Matrix metalloprotease-1 (MMP-1)
Ligand InfoPC cidPC sid
In DepthDetails ArticlePubMed
TargetStromelysin-1(Homo sapiens (Human))
Preclinical Research Novartis Pharma
Curated by ChEMBL
LigandPNGBDBM50473686(CHEMBL433314)
Affinity DataKi:  9.80nM. Assay description: Inhibitory potency against Matrix metalloprotease-3 (MMP-3)
Ligand InfoPC cidPC sid
In DepthDetails ArticlePubMed
TargetDisintegrin and metalloproteinase domain-containing protein 17(Homo sapiens (Human))
Preclinical Research Novartis Pharma
Curated by ChEMBL
LigandPNGBDBM50473686(CHEMBL433314)
Affinity DataKi:  13nM. Assay description: Inhibitory potency against Tumor necrosis factor alpha converting enzyme (TACE)
Ligand InfoPC cidPC sid
In DepthDetails ArticlePubMed
TargetTumor necrosis factor(Homo sapiens (Human))
Preclinical Research Novartis Pharma
Curated by ChEMBL
LigandPNGBDBM50473686(CHEMBL433314)
Affinity DataIC50:  1.61E+3nM. Assay description: Inhibitory activity against tumor necrosis factor alpha (TNF-alpha) production in LPS-stimulated human PBMCs
Ligand InfoPC cidPC sid
In DepthDetails ArticlePubMed