BDBM50474910 CHEMBL189836
SMILES [H][C@@]1(CC[C@]2(C)C3CCC4C(C)(C)C(=O)C(C=O)=C[C@]4(C)C3=CC[C@]12C)[C@H](C)CC[C@@H](O)C(C)(C)O
InChI Key InChIKey=VCQYJXWOTVAGQM-GCWQWUROSA-N
Data  1 IC50
  Tab Delimited (TSV)   2D SDfile   Computed 3D by Vconf -m prep SDfile
Find this compound or compounds like it in BindingDB:
Activity Spreadsheet -- Enzyme Inhibition Constant Data from BindingDB
Found 1 hit for monomerid = 50474910
TargetDNA topoisomerase 2-alpha/2-beta(Homo sapiens (Human))
Osaka University Of Pharmaceutical Sciences
Curated by ChEMBL
LigandPNGBDBM50474910(CHEMBL189836)
Affinity DataIC50:  1.86E+3nM. Assay description: Inhibitory concentration against human DNA topoisomerase II
Ligand InfoPC cidPC sid
In DepthDetails ArticlePubMed