BDBM50475594 CHEMBL199962
SMILES OC1=C(C(=O)O\C1=C/c1ccc(Cl)cc1)c1ccc(cc1)-c1ccccc1
InChI Key InChIKey=LIVPIDHBDNCBEX-ZHZULCJRSA-N
Data  3 IC50
  Tab Delimited (TSV)   2D SDfile   Computed 3D by Vconf -m prep SDfile
Find this compound or compounds like it in BindingDB:
Activity Spreadsheet -- Enzyme Inhibition Constant Data from BindingDB
Found 3 hits for monomerid = 50475594
TargetUDP-N-acetylglucosamine 1-carboxyvinyltransferase(Escherichia coli K-12 (Enterobacteria))
Wyeth Research
Curated by ChEMBL
LigandPNGBDBM50475594(CHEMBL199962)
Affinity DataIC50: >6.66E+4nM. Assay description: Inhibitory activity against MurA in Escherichia coli
Ligand InfoPC cidPC sid
In DepthDetails ArticlePubMed
TargetUDP-N-acetylmuramoylalanine--D-glutamate ligase(Escherichia coli (strain K12))
Wyeth Research
Curated by ChEMBL
LigandPNGBDBM50475594(CHEMBL199962)
Affinity DataIC50: >6.66E+4nM. Assay description: Inhibitory activity against MurD in Escherichia coli
Ligand InfoPC cidPC sid
In DepthDetails ArticlePubMed
TargetUDP-N-acetylmuramate--L-alanine ligase(Escherichia coli)
Wyeth Research
Curated by ChEMBL
LigandPNGBDBM50475594(CHEMBL199962)
Affinity DataIC50:  4.26E+4nM. Assay description: Inhibitory activity against MurC in Escherichia coli
Ligand InfoPC cidPC sid
In DepthDetails ArticlePubMed