BDBM50476244 CHEMBL389511
SMILES O=C1C[C@@H](NC2CCS(=O)(=O)CC2)C(=O)NC[C@@H](Cc2ccccc2)NC(=O)[C@H](Cc2ccccc2)NC(=O)[C@H](Cc2c[nH]c3ccccc23)N1
InChI Key InChIKey=UMSSCTNYYHRMNN-ODRDEDCPSA-N
Data  1 KI
  Tab Delimited (TSV)   2D SDfile   Computed 3D by Vconf -m prep SDfile
Find this compound or compounds like it in BindingDB:
Activity Spreadsheet -- Enzyme Inhibition Constant Data from BindingDB
Found 1 hit for monomerid = 50476244
TargetSubstance-K receptor(Homo sapiens (Human))
Menarini Ricerche
Curated by ChEMBL
LigandPNGBDBM50476244(CHEMBL389511)
Affinity DataKi:  0.158nM. Assay description: Displacement of [125I]neurokinin A from human NK2 receptor expressed in CHOK1 cells
Ligand InfoPC cidPC sid
In DepthDetails ArticlePubMed