BDBM50478515 Aleuritolic Acid::CHEBI:73107::Maprounic Acid
SMILES [H][C@@]12CC[C@@]3(C)C4=CC[C@]5(CCC(C)(C)C[C@@]5([H])[C@]4(C)CC[C@]3([H])[C@@]1(C)CC[C@H](O)C2(C)C)C(O)=O
InChI Key InChIKey=BHHPRAFMEFGOLZ-QVUWEPBXSA-N
Data  2 IC50
  Tab Delimited (TSV)   2D SDfile   Computed 3D by Vconf -m prep SDfile
Find this compound or compounds like it in BindingDB:
Activity Spreadsheet -- Enzyme Inhibition Constant Data from BindingDB
Found 2 hits for monomerid = 50478515
TargetDNA ligase 1(Homo sapiens (Human))
University Of Allahabad
Curated by ChEMBL
LigandPNGBDBM50478515(Aleuritolic Acid | CHEBI:73107 | Maprounic Acid)
Affinity DataIC50:  2.08E+5nM. Assay description: Inhibition of human DNA ligase 1 using 52-mer DNA/25-mer DNA/27-mer DNA as substrate by fluorescence assay
Ligand InfoPC cidPC sid
In DepthDetails ArticlePubMed
TargetReverse transcriptase(Human immunodeficiency virus 1)
University Of Illinois At Chicago
Curated by ChEMBL
LigandPNGBDBM50478515(Aleuritolic Acid | CHEBI:73107 | Maprounic Acid)
Affinity DataIC50:  2.49E+4nM. Assay description: Inhibition of HIV1 reverse transcriptase
Ligand InfoPC cidPC sid
In DepthDetails ArticlePubMed